Target
Cystine/glutamate transporter
Ligand
BDBM50378668
Substrate
Meas. Tech.
ChEMBL_607279 (CHEMBL1072821)
IC50
225000±n/a nM
Citation
 Patel, SARajale, TO'Brien, EBurkhart, DJNelson, JKTwamley, BBlumenfeld, ASzabon-Watola, MIGerdes, JMBridges, RJNatale, NR Isoxazole analogues bind the system xc- transporter: structure-activity relationship and pharmacophore model. Bioorg Med Chem 18:202-13 (2010)  
Target
Name:
Cystine/glutamate transporter
Synonyms:
SLC7A11 | XCT_HUMAN
Type:
PROTEIN
Mol. Mass.:
55437.48
Organism:
Homo sapiens (Human)
Description:
ChEMBL_772170
Residue:
501
  
Inhibitor
Name:
BDBM50378668
Synonyms:
CHEMBL606915
Type:
Small organic molecule
Emp. Form.:
C24H19N5O7
Mol. Mass.:
489.437
SMILES:
CC(N=Nc1ccc(cc1[N+]([O-])=O)[N+]([O-])=O)c1c(CCc2ccc3ccccc3c2)onc1C(O)=O
: