Target
Breast cancer type 1 susceptibility protein
Ligand
BDBM50380358
Substrate
Meas. Tech.
ChEMBL_812733 (CHEMBL2019951)
Ki
80±n/a nM
Citation
 Yuan, ZKumar, EACampbell, SJPalermo, NYKizhake, SMark Glover, JNNatarajan, A Exploiting the P-1 pocket of BRCT domains toward a structure guided inhibitor design. ACS Med Chem Lett 2:764-767 (2011)  
Target
Name:
Breast cancer type 1 susceptibility protein
Synonyms:
BRCA1 RNF53
Type:
PROTEIN
Mol. Mass.:
207672.68
Organism:
Homo sapiens (Human)
Description:
ChEMBL_812733
Residue:
1863
  
Inhibitor
Name:
BDBM50380358
Synonyms:
CHEMBL2017821
Type:
Small organic molecule
Emp. Form.:
C35H41N4O10P
Mol. Mass.:
708.6946
SMILES:
CC(C)[C@H](NC(=O)[C@@H]1CCCN1C(=O)[C@H](COP(O)(O)=O)NC(=O)c1cccc(c1)-c1ccccc1)C(=O)N[C@@H](Cc1ccccc1)C(O)=O
: