Target
Poly [ADP-ribose] polymerase tankyrase-2
Ligand
BDBM50380604
Substrate
Meas. Tech.
ChEMBL_813155 (CHEMBL2020821)
IC50
>19000±n/a nM
Citation
 Shultz, MDKirby, CAStams, TChin, DNBlank, JCharlat, OCheng, HCheung, ACong, FFeng, YFortin, PDHood, TTyagi, VXu, MZhang, BShao, W [1,2,4]triazol-3-ylsulfanylmethyl)-3-phenyl-[1,2,4]oxadiazoles: antagonists of the Wnt pathway that inhibit tankyrases 1 and 2 via novel adenosine pocket binding. J Med Chem 55:1127-36 (2012)  
Target
Name:
Poly [ADP-ribose] polymerase tankyrase-2
Synonyms:
(ARTD6 or PARP5b) Poly [ADP-ribose] polymerase tankyrase-2 TNKL TNKS2_HUMAN Tankyrase 2 Tankyrase-2 Tankyrase-2 (TNKS2)
Type:
Enzyme
Mol. Mass.:
126937.16
Organism:
Homo sapiens (Human)
Description:
Q9H2K2
Residue:
1166
  
Inhibitor
Name:
BDBM50380604
Synonyms:
CHEMBL2016639
Type:
Small organic molecule
Emp. Form.:
C23H16FN5OS
Mol. Mass.:
429.469
SMILES:
Fc1ccc(cc1)-c1nnc(SCc2nc(no2)-c2ccccc2)n1-c1ccccc1
: