Target
Carboxylic ester hydrolase
Ligand
BDBM50381962
Substrate
Meas. Tech.
ChEMBL_815076 (CHEMBL2024801)
IC50
>100000±n/a nM
Citation
 Samadi, Ade los Ríos, CBolea, IChioua, MIriepa, IMoraleda, IBartolini, MAndrisano, VGálvez, EValderas, CUnzeta, MMarco-Contelles, J Multipotent MAO and cholinesterase inhibitors for the treatment of Alzheimer's disease: synthesis, pharmacological analysis and molecular modeling of heterocyclic substituted alkyl and cycloalkyl propargyl amine. Eur J Med Chem 52:251-62 (2012)  
Target
Name:
Carboxylic ester hydrolase
Synonyms:
BuChE Butyrylcholine esterase Butyrylcholinesterase (BChE) Butyrylcholinesterase (EqBuChE) butyrylcholinesterase precursor
Type:
Protein
Mol. Mass.:
68842.83
Organism:
Equus caballus (Horse)
Description:
Q9N1N9
Residue:
602
  
Inhibitor
Name:
BDBM50381962
Synonyms:
CHEMBL2022930
Type:
Small organic molecule
Emp. Form.:
C15H12ClN5
Mol. Mass.:
297.742
SMILES:
Nc1c2CN(CC#C)CCc2nc2nc(Cl)c(cc12)C#N
: