Target
Amine oxidase [flavin-containing] A
Ligand
BDBM50381955
Substrate
Meas. Tech.
ChEMBL_814868 (CHEMBL2026610)
IC50
99260±n/a nM
Citation
 Samadi, Ade los Ríos, CBolea, IChioua, MIriepa, IMoraleda, IBartolini, MAndrisano, VGálvez, EValderas, CUnzeta, MMarco-Contelles, J Multipotent MAO and cholinesterase inhibitors for the treatment of Alzheimer's disease: synthesis, pharmacological analysis and molecular modeling of heterocyclic substituted alkyl and cycloalkyl propargyl amine. Eur J Med Chem 52:251-62 (2012)  
Target
Name:
Amine oxidase [flavin-containing] A
Synonyms:
AOFA_RAT Amine oxidase [flavin-containing] A Monoamine Oxidase Type A (MAO-A) Monoamine oxidase A (MAO-A) Monoamine oxidase type A (MAOA)
Type:
Enzyme
Mol. Mass.:
59515.21
Organism:
Rattus norvegicus (rat)
Description:
Residue:
526
  
Inhibitor
Name:
BDBM50381955
Synonyms:
CHEMBL2022923
Type:
Small organic molecule
Emp. Form.:
C18H20N2O
Mol. Mass.:
280.3642
SMILES:
CNCc1cc2cc(OCc3ccccc3)ccc2n1C
: