Target
TGF-beta receptor type-1
Ligand
BDBM50382318
Substrate
Meas. Tech.
ChEMBL_815898 (CHEMBL2026333)
IC50
44±n/a nM
Citation
 Boys, MLBian, FKramer, JBChio, CLRen, XDChen, HBarrett, SDSexton, KEIula, DMFilzen, GFNguyen, MNAngell, PDowns, VLWang, ZRaheja, NEllsworth, ELFakhoury, SBratton, LDKeller, PRGowan, RDrummond, EMMaiti, SNHena, MALu, LMcConnell, PKnafels, JDThanabal, VSun, FAlessi, DMcCarthy, AZhang, EFinzel, BCPatel, SCiotti, SMEisma, RPayne, NAGilbertsen, RBKostlan, CRPocalyko, DJLala, DS Discovery of a series of 2-(1H-pyrazol-1-yl)pyridines as ALK5 inhibitors with potential utility in the prevention of dermal scarring. Bioorg Med Chem Lett 22:3392-7 (2012)  
Target
Name:
TGF-beta receptor type-1
Synonyms:
2.7.11.30 AU017197 TGF-beta receptor type I TGFR-1 TbetaR-I Transforming growth factor-beta receptor type I
Type:
Mol. Mass.:
56186.39
Organism:
Mus musculus
Description:
Residue:
503
  
Inhibitor
Name:
BDBM50382318
Synonyms:
CHEMBL2024685
Type:
Small organic molecule
Emp. Form.:
C19H15N5O
Mol. Mass.:
329.3553
SMILES:
Cc1cccc(n1)-n1nccc1-c1ccc2ncn(C=C)c(=O)c2c1
: