Target
Mitogen-activated protein kinase 14
Ligand
BDBM15244
Substrate
Meas. Tech.
ChEMBL_817610 (CHEMBL2027258)
IC50
150±n/a nM
Citation
 Duffy, JPHarrington, EMSalituro, FGCochran, JEGreen, JGao, HBemis, GWEvindar, GGalullo, VPFord, PJGermann, UAWilson, KPBellon, SFChen, GTaslimi, PJones, PHuang, CPazhanisamy, SWang, YMMurcko, MASu, MS The Discovery of VX-745: A Novel and Selective p38a Kinase Inhibitor. ACS Med Chem Lett 2:758-763 (2011)  
Target
Name:
Mitogen-activated protein kinase 14
Synonyms:
CSAID-binding protein CSBP1 CSPB1 MAP kinase 14 MAP kinase p38 alpha MAPK14 MK14_HUMAN Mitogen-activated protein kinase p38 alpha Stress-activated protein kinase 2a | p38 MAP kinase alpha/beta
Type:
Serine/threonine-protein kinase
Mol. Mass.:
41286.76
Organism:
Homo sapiens (Human)
Description:
Q16539
Residue:
360
  
Inhibitor
Name:
BDBM15244
Synonyms:
5-(2,6-dichlorophenyl)-2-(2,4-difluorophenyl)sulfanylpyrimido[1,6-b]pyridazin-6-one 5-(2,6-dichlorophenyl)-2-[(2,4-difluorophenyl)thio]-6-pyrimido[1,6-b]pyridazinone 5-(2,6-dichlorophenyl)-9-(2,4-difluorophenyl)sulfanyl-1,3,10-triazabicyclo[4.4.0]deca-2,5,7,9-tetraen-4-one VX-745 cid_3038525
Type:
Small organic molecule
Emp. Form.:
C19H9Cl2F2N3OS
Mol. Mass.:
436.262
SMILES:
Fc1ccc(Sc2ccc3c(-c4c(Cl)cccc4Cl)c(=O)ncn3n2)c(F)c1
: