Target
11-beta-hydroxysteroid dehydrogenase type 2
Ligand
BDBM50382820
Substrate
Meas. Tech.
ChEMBL_815022 (CHEMBL2027168)
EC50
860±n/a nM
Citation
 Zhang, LChen, JNing, MZou, QLeng, YShen, J Synthesis and evaluation of piperidine urea derivatives as efficacious 11ß-hydroxysteroid dehydrogenase type 1 inhibitors in diabetic ob/ob mice. Bioorg Med Chem Lett 22:2748-52 (2012)  
Target
Name:
11-beta-hydroxysteroid dehydrogenase type 2
Synonyms:
11-DH2 11-beta-Hydroxysteroid Dehydrogenase 2 (11-beta-HSD2) 11-beta-hydroxysteroid dehydrogenase 2 11-beta-hydroxysteroid dehydrogenase type 2 (11-beta-HSD2) DHI2_HUMAN HSD11K SDR9C3
Type:
Enzyme
Mol. Mass.:
44141.72
Organism:
Homo sapiens (Human)
Description:
Purified recombinant human 11beta-HSD2.
Residue:
405
  
Inhibitor
Name:
BDBM50382820
Synonyms:
CHEMBL2023585
Type:
Small organic molecule
Emp. Form.:
C22H31ClN4O4S
Mol. Mass.:
483.024
SMILES:
CN(C1CCCCCC1)C(=O)N1CCC(CN2C(=O)Nc3ccc(Cl)cc3S2(=O)=O)CC1
: