Target
Dual specificity mitogen-activated protein kinase kinase 1
Ligand
BDBM50382959
Substrate
Meas. Tech.
ChEMBL_817994 (CHEMBL2033420)
Kd
7100±n/a nM
Citation
 Rowbottom, MWFaraoni, RChao, QCampbell, BTLai, AGSetti, EEzawa, MSprankle, KGAbraham, STran, LStruss, BGibney, MArmstrong, RCGunawardane, RNNepomuceno, RRValenta, IHua, HGardner, MFCramer, MDGitnick, DInsko, DEApuy, JLJones-Bolin, SGhose, AKHerbertz, TAtor, MADorsey, BDRuggeri, BWilliams, MBhagwat, SJames, JHolladay, MW Identification of 1-(3-(6,7-dimethoxyquinazolin-4-yloxy)phenyl)-3-(5-(1,1,1-trifluoro-2-methylpropan-2-yl)isoxazol-3-yl)urea hydrochloride (CEP-32496), a highly potent and orally efficacious inhibitor of V-RAF murine sarcoma viral oncogene homologue B1 (BRAF) V600E. J Med Chem 55:1082-105 (2012)  
Target
Name:
Dual specificity mitogen-activated protein kinase kinase 1
Synonyms:
Dual specificity mitogen-activated protein kinase (MEK) Dual specificity mitogen-activated protein kinase kinase 1 (MEK1) Dual specificity mitogen-activated protein kinase kinase MEK1/2 MAP kinase kinase 1 MAPK/ERK kinase 1 MEK-1 MP2K1_HUMAN PRKMK1 | VHL-MAP2K1/MAP2K2
Type:
Other Protein Type
Mol. Mass.:
43439.03
Organism:
Homo sapiens (Human)
Description:
Full-length human MEK-1 was generated by PCR and purified as a fusion protein from Escherichia coli lysates.
Residue:
393
  
Inhibitor
Name:
BDBM50382959
Synonyms:
CEP-32496 US9730937, Example 261
Type:
Small organic molecule
Emp. Form.:
C24H22F3N5O5
Mol. Mass.:
517.4572
SMILES:
COc1cc2ncnc(Oc3cccc(NC(=O)Nc4cc(on4)C(C)(C)C(F)(F)F)c3)c2cc1OC
: