Target
Insulin-like growth factor 1 receptor
Ligand
BDBM50383179
Substrate
Meas. Tech.
ChEMBL_819187 (CHEMBL2032456)
Ki
744±n/a nM
Citation
 Liu, LNorman, MHLee, MXi, NSiegmund, ABoezio, AABooker, SChoquette, DD'Angelo, NDGermain, JYang, KYang, YZhang, YBellon, SFWhittington, DAHarmange, JCDominguez, CKim, TSDussault, I Structure-based design of novel class II c-Met inhibitors: 2. SAR and kinase selectivity profiles of the pyrazolone series. J Med Chem 55:1868-97 (2012)  
Target
Name:
Insulin-like growth factor 1 receptor
Synonyms:
CD_antigen=CD221 IGF1R Insulin-like growth factor 1 receptor (IGF1R) Insulin-like growth factor 1 receptor alpha chain Insulin-like growth factor I receptor | Insulin-like growth factor receptor (IGFR)
Type:
Protein
Mol. Mass.:
154776.79
Organism:
Homo sapiens (Human)
Description:
P08069
Residue:
1367
  
Inhibitor
Name:
BDBM50383179
Synonyms:
CHEMBL2031905
Type:
Small organic molecule
Emp. Form.:
C31H30FN5O4
Mol. Mass.:
555.5994
SMILES:
CCN(C)Cc1c(C(=O)Nc2ccc(Oc3ccnc4cc(OC)ccc34)c(F)c2)c(=O)n(-c2ccccc2)n1C
: