Target
Hydroxycarboxylic acid receptor 3
Ligand
BDBM50384637
Substrate
Meas. Tech.
ChEMBL_820674 (CHEMBL2037945)
EC50
59±n/a nM
Citation
 Palani, ARao, AUChen, XHuang, XSu, JTang, HHuang, YQin, JXiao, DDegrado, SSofolarides, MZhu, XLiu, ZMcKittrick, BZhou, WAslanian, RGreenlee, WJSenior, MCheewatrakoolpong, BZhang, HFarley, CCook, JKurowski, SLi, Qvan Heek, MWang, GHsieh, YLi, FGreenfeder, SChintala, M Discovery of SCH 900271, a Potent Nicotinic Acid Receptor Agonist for the Treatment of Dyslipidemia. ACS Med Chem Lett 3:63-68 (2012)  
Target
Name:
Hydroxycarboxylic acid receptor 3
Synonyms:
G-protein coupled receptor 109B G-protein coupled receptor HM74B HCA3 HCAR3_HUMAN HM74B NIACR2 Nicotinic acid receptor 2
Type:
Enzyme Catalytic Domain
Mol. Mass.:
44498.06
Organism:
Homo sapiens (Human)
Description:
GPR109B 0 HUMAN::P49019
Residue:
387
  
Inhibitor
Name:
BDBM50384637
Synonyms:
CHEMBL2036951
Type:
Small organic molecule
Emp. Form.:
C11H10F2N2O4
Mol. Mass.:
272.2049
SMILES:
FC(F)CCCc1cc(=O)oc2[nH]c(=O)[nH]c(=O)c12
: