Target
Cathepsin B
Ligand
BDBM50189278
Substrate
Meas. Tech.
ChEMBL_831048 (CHEMBL2065749)
IC50
>10000±n/a nM
Citation
 Song, JJones, LMKumar, GDConner, ESBayeh, LChavarria, GECharlton-Sevcik, AKChen, SEChaplin, DJTrawick, MLPinney, KG Synthesis and biochemical evaluation of thiochromanone thiosemicarbazone analogues as inhibitors of cathepsin L. ACS Med Chem Lett 3:450-453 (2012)  
Target
Name:
Cathepsin B
Synonyms:
APP secretase CATB_HUMAN CTSB Cathepsin B light chain | Cathepsin B1
Type:
Enzyme
Mol. Mass.:
37819.69
Organism:
Homo sapiens (Human)
Description:
gi_63102437
Residue:
339
  
Inhibitor
Name:
BDBM50189278
Synonyms:
6-bromo-2,3-dihydro-4H-thiochromen-4-one thiosemicarbazone 1,1-dioxide | CHEMBL214219
Type:
Small organic molecule
Emp. Form.:
C10H10BrN3O2S2
Mol. Mass.:
348.239
SMILES:
NC(=S)NN=C1CCS(=O)(=O)c2ccc(Br)cc12
: