Target
Cathepsin B
Ligand
BDBM50390389
Substrate
Meas. Tech.
ChEMBL_834958 (CHEMBL2073368)
IC50
3162.28±n/a nM
Citation
 Dossetter, AGBowyer, JCook, CRCrawford, JJFinlayson, JEHeron, NMHeyes, CHighton, AJHudson, JAJestel, AKrapp, SMacFaul, PAMcGuire, TMMorley, ADMorris, JJPage, KMRibeiro, LRSawney, HSteinbacher, SSmith, C Isosteric replacements for benzothiazoles and optimisation to potent Cathepsin K inhibitors free from hERG channel inhibition. Bioorg Med Chem Lett 22:5563-8 (2012)  
Target
Name:
Cathepsin B
Synonyms:
APP secretase CATB_HUMAN CTSB Cathepsin B light chain | Cathepsin B1
Type:
Enzyme
Mol. Mass.:
37819.69
Organism:
Homo sapiens (Human)
Description:
gi_63102437
Residue:
339
  
Inhibitor
Name:
BDBM50390389
Synonyms:
CHEMBL2070940
Type:
Small organic molecule
Emp. Form.:
C21H29N5O2S
Mol. Mass.:
415.552
SMILES:
CCc1csc(n1)N1CCN(CC1)C(=O)[C@@H]1CCCC[C@H]1C(=O)NC1(CC1)C#N
: