Target
Cytochrome P450 2C19
Ligand
BDBM50390397
Substrate
Meas. Tech.
ChEMBL_835100 (CHEMBL2073644)
IC50
10000±n/a nM
Citation
 Dossetter, AGBowyer, JCook, CRCrawford, JJFinlayson, JEHeron, NMHeyes, CHighton, AJHudson, JAJestel, AKrapp, SMacFaul, PAMcGuire, TMMorley, ADMorris, JJPage, KMRibeiro, LRSawney, HSteinbacher, SSmith, C Isosteric replacements for benzothiazoles and optimisation to potent Cathepsin K inhibitors free from hERG channel inhibition. Bioorg Med Chem Lett 22:5563-8 (2012)  
Target
Name:
Cytochrome P450 2C19
Synonyms:
CP2CJ_HUMAN CYPIIC17 Cytochrome P450 2C19 (CYP2C19) Mephenytoin 4-hydroxylase P450-254C
Type:
Enzyme
Mol. Mass.:
55935.47
Organism:
Homo sapiens (Human)
Description:
P33261
Residue:
490
  
Inhibitor
Name:
BDBM50390397
Synonyms:
CHEMBL2070948
Type:
Small organic molecule
Emp. Form.:
C23H30N6O2S
Mol. Mass.:
454.588
SMILES:
CC(C)(C#N)c1cnc(s1)N1CCN(CC1)C(=O)[C@@H]1CCCC[C@H]1C(=O)NC1(CC1)C#N
: