Target
Cathepsin S
Ligand
BDBM50390392
Substrate
Meas. Tech.
ChEMBL_834957 (CHEMBL2073367)
IC50
1584.89±n/a nM
Citation
 Dossetter, AGBowyer, JCook, CRCrawford, JJFinlayson, JEHeron, NMHeyes, CHighton, AJHudson, JAJestel, AKrapp, SMacFaul, PAMcGuire, TMMorley, ADMorris, JJPage, KMRibeiro, LRSawney, HSteinbacher, SSmith, C Isosteric replacements for benzothiazoles and optimisation to potent Cathepsin K inhibitors free from hERG channel inhibition. Bioorg Med Chem Lett 22:5563-8 (2012)  
Target
Name:
Cathepsin S
Synonyms:
CATS_HUMAN Cathepsin S (Cat S) | cathepsin S preproprotein
Type:
Protein
Mol. Mass.:
37507.38
Organism:
Homo sapiens (Human)
Description:
P25774
Residue:
331
  
Inhibitor
Name:
BDBM50390392
Synonyms:
CHEMBL2070942
Type:
Small organic molecule
Emp. Form.:
C23H33N5O2S
Mol. Mass.:
443.605
SMILES:
CC(C)(C)c1csc(n1)N1CCN(CC1)C(=O)[C@@H]1CCCC[C@H]1C(=O)NC1(CC1)C#N
: