Target
Sodium channel protein type 5 subunit alpha
Ligand
BDBM50391507
Substrate
Meas. Tech.
ChEMBL_849457 (CHEMBL2149458)
IC50
<31623±n/a nM
Citation
 Kers, IMacsari, ICsjernyik, GNylöf, MSkogholm, KSandberg, LMinidis, ABueters, TMalmborg, JEriksson, ABLund, PEVenyike, ELuo, LNyström, JEBesidski, Y Phenethyl nicotinamides, a novel class of Na(V)1.7 channel blockers: structure and activity relationship. Bioorg Med Chem Lett 22:6108-15 (2012)  
Target
Name:
Sodium channel protein type 5 subunit alpha
Synonyms:
HH1 SCN5A_HUMAN Sodium channel protein type 5 subunit alpha/beta-1/beta-2 Voltage-gated sodium channel subunit alpha Nav1.5
Type:
Enzyme
Mol. Mass.:
226908.60
Organism:
Homo sapiens (Human)
Description:
Q14524
Residue:
2016
  
Inhibitor
Name:
BDBM50391507
Synonyms:
CHEMBL2147314
Type:
Small organic molecule
Emp. Form.:
C22H22F3N5O3
Mol. Mass.:
461.437
SMILES:
COc1ncc(cn1)-c1cccnc1C(C)CNC(=O)c1ccc(OCCC(F)(F)F)nc1
: