Target
Fatty-acid amide hydrolase 1
Ligand
BDBM50394384
Substrate
Meas. Tech.
ChEMBL_854554 (CHEMBL2161049)
IC50
22±n/a nM
Citation
 Morera, LLabar, GOrtar, GLambert, DM Development and characterization of endocannabinoid hydrolases FAAH and MAGL inhibitors bearing a benzotriazol-1-yl carboxamide scaffold. Bioorg Med Chem 20:6260-75 (2012)  
Target
Name:
Fatty-acid amide hydrolase 1
Synonyms:
Anandamide amidohydrolase FAAH FAAH1_HUMAN Fatty-acid amide hydrolase (FAAH) Oleamide hydrolase 1
Type:
Protein
Mol. Mass.:
63071.19
Organism:
Homo sapiens (Human)
Description:
O00519
Residue:
579
  
Inhibitor
Name:
BDBM50394384
Synonyms:
CHEMBL2159803
Type:
Small organic molecule
Emp. Form.:
C18H18BrN5O
Mol. Mass.:
400.272
SMILES:
Brc1ccc(CN2CCN(CC2)C(=O)n2nnc3ccccc23)cc1
: