Target
Platelet glycoprotein 4
Ligand
BDBM50394987
Substrate
Meas. Tech.
ChEMBL_858884 (CHEMBL2167930)
IC50
>10000±n/a nM
Citation
 Proulx, CPicard, ÉBoeglin, DPohankova, PChemtob, SOng, HLubell, WD Azapeptide analogues of the growth hormone releasing peptide 6 as cluster of differentiation 36 receptor ligands with reduced affinity for the growth hormone secretagogue receptor 1a. J Med Chem 55:6502-11 (2012)  
Target
Name:
Platelet glycoprotein 4
Synonyms:
Adipocyte membrane protein CD_antigen=CD36 Fat Fatty acid transport protein GPIV PAS IV Platelet glycoprotein IV
Type:
PROTEIN
Mol. Mass.:
52740.95
Organism:
Rattus norvegicus
Description:
ChEMBL_858884
Residue:
472
  
Inhibitor
Name:
BDBM50394987
Synonyms:
CHEMBL2163462 | US9708370, CP-AP-2
Type:
Small organic molecule
Emp. Form.:
C41H53N13O6
Mol. Mass.:
823.943
SMILES:
C[C@H](NC(=O)[C@@H](Cc1c[nH]c2ccccc12)NC(=O)[C@@H](N)Cc1cnc[nH]1)C(=O)N[C@@H](Cc1c[nH]c2ccccc12)C(=O)N1CCCN1C(=O)N[C@@H](CCCCN)C(N)=O
: