Target
RAC-alpha serine/threonine-protein kinase
Ligand
BDBM50398370
Substrate
Meas. Tech.
ChEMBL_875897 (CHEMBL2187635)
IC50
367±n/a nM
Citation
 Blake, JFXu, RBencsik, JRXiao, DKallan, NCSchlachter, SMitchell, ISSpencer, KLBanka, ALWallace, EMGloor, SLMartinson, MWoessner, RDVigers, GPBrandhuber, BJLiang, JSafina, BSLi, JZhang, BChabot, CDo, SLee, LOeh, JSampath, DLee, BBLin, KLiederer, BMSkelton, NJ Discovery and preclinical pharmacology of a selective ATP-competitive Akt inhibitor (GDC-0068) for the treatment of human tumors. J Med Chem 55:8110-27 (2012)  
Target
Name:
RAC-alpha serine/threonine-protein kinase
Synonyms:
AKT phosphorylation (p-AKT) AKT1/PPP1CA C-AKT PKB alpha Protein kinase B Protein kinase B (Akt 1) Protein kinase B alpha Proto-oncogene Akt (Akt1) Proto-oncogene c-Akt (AKT1) RAC-PK-alpha RAC-alpha serine/threonine-protein kinase (AKT1) | RAC-alpha serine/threonine-protein kinase (pAKT)
Type:
Enzyme
Mol. Mass.:
55681.25
Organism:
Homo sapiens (Human)
Description:
P31749
Residue:
480
  
Inhibitor
Name:
BDBM50398370
Synonyms:
CHEMBL2177364
Type:
Small organic molecule
Emp. Form.:
C27H36ClN5O2
Mol. Mass.:
498.06
SMILES:
C[C@@H]1C[C@@H](O)c2ncnc(N3CCN(CC3)C(=O)[C@H](CNC3CCCCC3)c3ccc(Cl)cc3)c12
: