Target
Metabotropic glutamate receptor 5
Ligand
BDBM50401689
Substrate
Meas. Tech.
ChEMBL_884985 (CHEMBL2211245)
IC50
1000±n/a nM
Citation
 Brumfield, SKorakas, PSilverman, LSTulshian, DMatasi, JJQiang, LBennett, CEBurnett, DAGreenlee, WJKnutson, CEWu, WLSasikumar, TKDomalski, MBertorelli, RGrilli, MLozza, GReggiani, ALi, C Synthesis and SAR development of novel mGluR1 antagonists for the treatment of chronic pain. Bioorg Med Chem Lett 22:7223-6 (2012)  
Target
Name:
Metabotropic glutamate receptor 5
Synonyms:
GPRC1E GRM5_HUMAN metabotropic glutamate 5 | metabotropic glutamate 5a
Type:
Enzyme
Mol. Mass.:
132484.72
Organism:
Homo sapiens (Human)
Description:
Residue:
1212
  
Inhibitor
Name:
BDBM50401689
Synonyms:
CHEMBL2205920
Type:
Small organic molecule
Emp. Form.:
C17H15N5O2S
Mol. Mass.:
353.398
SMILES:
COc1ccc(cc1)-n1cnc2c(sc3ncnc(N(C)C)c23)c1=O
: