Target
ATP-dependent translocase ABCB1
Ligand
BDBM81939
Substrate
Meas. Tech.
ChEMBL_836268 (CHEMBL2076281)
EC50
3100±n/a nM
Citation
 Leonessa, FKim, JHGhiorghis, AKulawiec, RJHammer, CTalebian, AClarke, R C-7 analogues of progesterone as potent inhibitors of the P-glycoprotein efflux pump. J Med Chem 45:390-8 (2002)  
Target
Name:
ATP-dependent translocase ABCB1
Synonyms:
ABCB1 MDR1_HUMAN Multidrug resistance protein 1 P-glycoprotein (P-gp) PGY1
Type:
Protein
Mol. Mass.:
141503.50
Organism:
Homo sapiens (Human)
Description:
P08183
Residue:
1280
  
Inhibitor
Name:
BDBM81939
Synonyms:
CAS_52-53-9 VERAPAMIL
Type:
Small organic molecule
Emp. Form.:
C27H38N2O4
Mol. Mass.:
454.6016
SMILES:
COc1ccc(CCN(C)CCCC(C#N)(C(C)C)c2ccc(OC)c(OC)c2)cc1OC
: