Target
Leucyl-cystinyl aminopeptidase
Ligand
BDBM85550
Substrate
Meas. Tech.
ChEMBL_619204 (CHEMBL1100890)
Ki
831.76±n/a nM
Citation
 Lukaszuk, ADemaegdt, HFeytens, DVanderheyden, PVauquelin, GTourwé, D The replacement of His(4) in angiotensin IV by conformationally constrained residues provides highly potent and selective analogues. J Med Chem 52:5612-8 (2009)  
Target
Name:
Leucyl-cystinyl aminopeptidase
Synonyms:
Aminopeptidase Cystinyl aminopeptidase Insulin-regulated membrane aminopeptidase LCAP_HUMAN Leucyl-cystinyl aminopeptidase, pregnancy serum form Oxytocinase Placental leucine aminopeptidase
Type:
PROTEIN
Mol. Mass.:
117334.10
Organism:
Homo sapiens (Human)
Description:
ChEMBL_1473494
Residue:
1025
  
Inhibitor
Name:
BDBM85550
Synonyms:
Ang IV CHEMBL261120 | cid_123814
Type:
Small organic molecule
Emp. Form.:
C40H54N8O8
Mol. Mass.:
774.9056
SMILES:
CC[C@H](C)[C@H](NC(=O)[C@H](Cc1ccc(O)cc1)NC(=O)[C@@H](N)C(C)C)C(=O)N[C@@H](Cc1cnc[nH]1)C(=O)N1CCC[C@H]1C(=O)N[C@@H](Cc1ccccc1)C(O)=O
: