Target
Muscarinic acetylcholine receptor M3
Ligand
BDBM50417429
Substrate
Meas. Tech.
ChEMBL_687865 (CHEMBL1291429)
IC50
125.89±n/a nM
Citation
 Stocks, MJAlcaraz, LBailey, ABowers, KDonald, DEdwards, HHunt, FKindon, NPairaudeau, GTheaker, JWarner, DJ The discovery of new spirocyclic muscarinic M3 antagonists. Bioorg Med Chem Lett 20:7458-61 (2010)  
Target
Name:
Muscarinic acetylcholine receptor M3
Synonyms:
ACM3_HUMAN Cholinergic, muscarinic M3 Muscarinic receptor M3 | RecName: Full=Muscarinic acetylcholine receptor M3
Type:
Enzyme
Mol. Mass.:
66151.03
Organism:
Homo sapiens (Human)
Description:
P20309
Residue:
590
  
Inhibitor
Name:
BDBM50417429
Synonyms:
CHEMBL1290294
Type:
Small organic molecule
Emp. Form.:
C23H28N2O
Mol. Mass.:
348.4812
SMILES:
O=C(N1CCC2(CCN(Cc3ccccc3)CC2)CC1)c1ccccc1
: