Target
Histamine H4 receptor
Ligand
BDBM26395
Substrate
Meas. Tech.
ChEMBL_766548 (CHEMBL1827029)
Ki
79.43±n/a nM
Citation
 Verheij, MHde Graaf, Cde Kloe, GENijmeijer, SVischer, HFSmits, RAZuiderveld, OPHulscher, SSilvestri, LThompson, AJvan Muijlwijk-Koezen, JELummis, SCLeurs, Rde Esch, IJ Fragment library screening reveals remarkable similarities between the G protein-coupled receptor histamine H4 and the ion channel serotonin 5-HT3A. Bioorg Med Chem Lett 21:5460-4 (2011)  
Target
Name:
Histamine H4 receptor
Synonyms:
AXOR35 GPCR105 HH4R HRH4 Histamine H4 receptor Histamine receptor (H3 and H4) SP9144
Type:
G Protein-Coupled Receptor (GPCR)
Mol. Mass.:
44517.02
Organism:
Homo sapiens (Human)
Description:
Binding assays were using CHO cells stably expressing hH4R receptors.
Residue:
390
  
Inhibitor
Name:
BDBM26395
Synonyms:
2,4-diamino-5,6-disubstituted pyrimidine, 9 | 6-(piperazin-1-yl)-3,5-diazatricyclo[9.4.0.0^{2,7}]pentadeca-1(15),2(7),3,5,11,13-hexaen-4-amine
Type:
Small organic molecule
Emp. Form.:
C17H21N5
Mol. Mass.:
295.3821
SMILES:
Nc1nc(N2CCNCC2)c2CCCc3ccccc3-c2n1
: