Target
Solute carrier family 22 member 6
Ligand
BDBM50344964
Substrate
Meas. Tech.
ChEMBL_838299 (CHEMBL2076247)
IC50
6000±n/a nM
Citation
 Mulato, ASHo, ESCihlar, T Nonsteroidal anti-inflammatory drugs efficiently reduce the transport and cytotoxicity of adefovir mediated by the human renal organic anion transporter 1. J Pharmacol Exp Ther 295:10-5 (2000) Target
Name:
Solute carrier family 22 member 6
Synonyms:
OAT1 PAH transporter Renal organic anion transporter 1 SLC22A6 hPAHT | hROAT1
Type:
PROTEIN
Mol. Mass.:
61831.78
Organism:
Homo sapiens (Human)
Description:
ChEMBL_1487359
Residue:
563
  
Inhibitor
Name:
BDBM50344964
Synonyms:
Betamipron N-(phenylcarbonyl)-beta-alanine
Type:
Small organic molecule
Emp. Form.:
C10H11NO3
Mol. Mass.:
193.1992
SMILES:
OC(=O)CCNC(=O)c1ccccc1
: