Target
Histamine H3 receptor
Ligand
BDBM85830
Substrate
Meas. Tech.
ChEMBL_341532 (CHEMBL861820)
IC50
1.3±n/a nM
Citation
 Govoni, MLim, HDEl-Atmioui, DMenge, WMTimmerman, HBakker, RALeurs, RDe Esch, IJ A chemical switch for the modulation of the functional activity of higher homologues of histamine on the human histamine H3 receptor: effect of various substitutions at the primary amino function. J Med Chem 49:2549-57 (2006)  
Target
Name:
Histamine H3 receptor
Synonyms:
G-protein coupled receptor 97 HH3R HRH3 Histamine H3 receptor (H3) Histamine receptor (H3 and H4)
Type:
G Protein-Coupled Receptor (GPCR)
Mol. Mass.:
48691.47
Organism:
Homo sapiens (Human)
Description:
Binding assays were using CHO cells stably expressing hH3R receptors.
Residue:
445
  
Inhibitor
Name:
BDBM85830
Synonyms:
VUF5202
Type:
Small organic molecule
Emp. Form.:
C15H20ClN3
Mol. Mass.:
277.792
SMILES:
Clc1ccc(CNCCCCCc2cnc[nH]2)cc1
: