Target
Proto-oncogene tyrosine-protein kinase ROS
Ligand
BDBM50429867
Substrate
Meas. Tech.
ChEMBL_943761 (CHEMBL2345774)
IC50
>10000±n/a nM
Citation
 Takeuchi, CSKim, BGBlazey, CMMa, SJohnson, HWAnand, NKArcalas, ABaik, TGBuhr, CACannoy, JEpshteyn, SJoshi, ALara, KLee, MSWang, LLeahy, JWNuss, JMAay, NAoyama, RFoster, PLee, JLehoux, IMunagala, NPlonowski, ARajan, SWoolfrey, JYamaguchi, KLamb, PMiller, N Discovery of a novel class of highly potent, selective, ATP-competitive, and orally bioavailable inhibitors of the mammalian target of rapamycin (mTOR). J Med Chem 56:2218-34 (2013)  
Target
Name:
Proto-oncogene tyrosine-protein kinase ROS
Synonyms:
MCF3 Proto-oncogene c-Ros-1 ROS1 Receptor tyrosine kinase c-ros oncogene 1 c-Ros receptor tyrosine kinase
Type:
Enzyme
Mol. Mass.:
263897.39
Organism:
Homo sapiens (Human)
Description:
P08922
Residue:
2347
  
Inhibitor
Name:
BDBM50429867
Synonyms:
CHEMBL2333365
Type:
Small organic molecule
Emp. Form.:
C23H22FN3O4S
Mol. Mass.:
455.502
SMILES:
Cc1c(F)c(ccc1C(=O)N1CCOc2ccc(cc2C1)-c1ccc(N)nc1)S(C)(=O)=O
: