Target
Lysophosphatidic acid receptor 5
Ligand
BDBM50430008
Substrate
Meas. Tech.
ChEMBL_946256 (CHEMBL2344994)
EC50
3.0±n/a nM
Citation
 Jiang, GInoue, AAoki, JPrestwich, GD Phosphorothioate analogs of sn-2 radyl lysophosphatidic acid (LPA): metabolically stabilized LPA receptor agonists. Bioorg Med Chem Lett 23:1865-9 (2013)  
Target
Name:
Lysophosphatidic acid receptor 5
Synonyms:
GPR92 LPAR5 Lysophosphatidic acid receptor 5 | Lysophosphatidic acid receptor 5 (LPA5)
Type:
Enzyme
Mol. Mass.:
41372.36
Organism:
Homo sapiens (Human)
Description:
Q9H1C0
Residue:
372
  
Inhibitor
Name:
BDBM50430008
Synonyms:
CHEMBL2335050
Type:
Small organic molecule
Emp. Form.:
C21H44O5PS
Mol. Mass.:
439.61
SMILES:
CCCCCCCCCCCCCCCCCOC(COC)COP(O)([O-])=S
: