Target
Lysophosphatidic acid receptor 4
Ligand
BDBM50430013
Substrate
Meas. Tech.
ChEMBL_946257 (CHEMBL2344995)
EC50
84±n/a nM
Citation
 Jiang, GInoue, AAoki, JPrestwich, GD Phosphorothioate analogs of sn-2 radyl lysophosphatidic acid (LPA): metabolically stabilized LPA receptor agonists. Bioorg Med Chem Lett 23:1865-9 (2013)  
Target
Name:
Lysophosphatidic acid receptor 4
Synonyms:
GPR23 LPAR4 P2RY9
Type:
PROTEIN
Mol. Mass.:
41910.31
Organism:
Homo sapiens (Human)
Description:
ChEMBL_946257
Residue:
370
  
Inhibitor
Name:
BDBM50430013
Synonyms:
CHEMBL364797
Type:
Small organic molecule
Emp. Form.:
C19H39O7P
Mol. Mass.:
410.4825
SMILES:
CCCCCCCCCCCCCCCC(=O)OC[C@@H](O)COP(O)(O)=O
: