Target
Neuronal acetylcholine receptor subunit alpha-7
Ligand
BDBM50433470
Substrate
Meas. Tech.
ChEMBL_959008 (CHEMBL2382821)
Ki
2.5±n/a nM
Citation
 Rötering, SScheunemann, MFischer, SHiller, APeters, DDeuther-Conrad, WBrust, P Radiosynthesis and first evaluation in mice of [(18)F]NS14490 for molecular imaging ofa7 nicotinic acetylcholine receptors. Bioorg Med Chem 21:2635-42 (2013)  
Target
Name:
Neuronal acetylcholine receptor subunit alpha-7
Synonyms:
ACHA7_HUMAN Cholinergic, Nicotinic Alpha7 Neuronal acetylcholine receptor protein alpha-7 subunit Nicotinic acetylcholine receptor alpha-7 (alpha7 nAChR)
Type:
Mol. Mass.:
56448.33
Organism:
Homo sapiens (Human)
Description:
CHRNA7 (NACHRA7)
Residue:
502
  
Inhibitor
Name:
BDBM50433470
Synonyms:
CHEMBL2380928
Type:
Small organic molecule
Emp. Form.:
C19H22FN5O
Mol. Mass.:
355.4093
SMILES:
FCCn1ccc2ccc(cc12)-c1nnc(o1)N1CCN2CCC1CC2
: