Target
Free fatty acid receptor 1
Ligand
BDBM50386790
Substrate
Meas. Tech.
ChEMBL_959727 (CHEMBL2383047)
EC50
42±n/a nM
Citation
 Lu, HFei, HYang, FZheng, SHu, QZhang, LYuan, JFeng, JSun, PDong, Q Discovery of novel orally bioavailable GPR40 agonists. Bioorg Med Chem Lett 23:2920-4 (2013)  
Target
Name:
Free fatty acid receptor 1
Synonyms:
FFAR1 G-protein Coupled Receptor 40 | GPR40
Type:
G Protein-Coupled Receptor (GPCR)
Mol. Mass.:
31473.32
Organism:
Homo sapiens (Human)
Description:
O14842
Residue:
300
  
Inhibitor
Name:
BDBM50386790
Synonyms:
CHEMBL1829174 TAK-875 | US11905230, Example TAK-875
Type:
Small organic molecule
Emp. Form.:
C29H32O7S
Mol. Mass.:
524.625
SMILES:
Cc1cc(OCCCS(C)(=O)=O)cc(C)c1-c1cccc(COc2ccc3[C@H](CC(O)=O)COc3c2)c1
: