Target
Protein Wnt-3a
Ligand
BDBM50439800
Substrate
Meas. Tech.
ChEMBL_977441 (CHEMBL2422476)
IC50
40±n/a nM
Citation
 Shultz, MDCheung, AKKirby, CAFirestone, BFan, JChen, CHChen, ZChin, DNDipietro, LFazal, AFeng, YFortin, PDGould, TLagu, BLei, HLenoir, FMajumdar, DOchala, EPalermo, MGPham, LPu, MSmith, TStams, TTomlinson, RCTouré, BBVisser, MWang, RMWaters, NJShao, W Identification of NVP-TNKS656: the use of structure-efficiency relationships to generate a highly potent, selective, and orally active tankyrase inhibitor. J Med Chem 56:6495-511 (2013)  
Target
Name:
Protein Wnt-3a
Synonyms:
WNT3A | WNT3A_HUMAN
Type:
PROTEIN
Mol. Mass.:
39379.02
Organism:
Homo sapiens (Human)
Description:
ChEMBL_1469237
Residue:
352
  
Inhibitor
Name:
BDBM50439800
Synonyms:
CHEMBL2419697 | US9181266, 1
Type:
Small organic molecule
Emp. Form.:
C22H25FN4O4
Mol. Mass.:
428.4567
SMILES:
Fc1ccc(cc1)C(=O)C1CCN(CC(=O)NCc2nc3CCOCc3c(=O)[nH]2)CC1
: