Target
Poly [ADP-ribose] polymerase 2
Ligand
BDBM50439796
Substrate
Meas. Tech.
ChEMBL_977442 (CHEMBL2422477)
IC50
>19000±n/a nM
Citation
 Shultz, MDCheung, AKKirby, CAFirestone, BFan, JChen, CHChen, ZChin, DNDipietro, LFazal, AFeng, YFortin, PDGould, TLagu, BLei, HLenoir, FMajumdar, DOchala, EPalermo, MGPham, LPu, MSmith, TStams, TTomlinson, RCTouré, BBVisser, MWang, RMWaters, NJShao, W Identification of NVP-TNKS656: the use of structure-efficiency relationships to generate a highly potent, selective, and orally active tankyrase inhibitor. J Med Chem 56:6495-511 (2013)  
Target
Name:
Poly [ADP-ribose] polymerase 2
Synonyms:
(ARTD2 or PARP2) ADPRTL2 PARP2_HUMAN Poly [ADP-ribose] polymerase 2 (PARP2)
Type:
Enzyme
Mol. Mass.:
66225.70
Organism:
Homo sapiens (Human)
Description:
Q9UGN5
Residue:
583
  
Inhibitor
Name:
BDBM50439796
Synonyms:
CHEMBL2419701 | US9181266, 26
Type:
Small organic molecule
Emp. Form.:
C26H33FN4O4
Mol. Mass.:
484.563
SMILES:
CC(C)CN(Cc1nc2CCOCc2c(=O)[nH]1)C(=O)CN1CCC(CC1)C(=O)c1ccc(F)cc1
: