Target
Histamine H3 receptor
Ligand
BDBM50441652
Substrate
Meas. Tech.
ChEMBL_986996 (CHEMBL2439316)
Ki
0.500000±n/a nM
Citation
 Zeng, QRosenblum, SBYang, ZJiang, YMcCormick, KDAslanian, RGDuguma, LKozlowski, JAShih, NYHey, JAWest, REKorfmacher, WABerlin, MBoyce, CW Synthesis and SAR studies of benzimidazolone derivatives as histamine H3-receptor antagonists. Bioorg Med Chem Lett 23:6001-3 (2013)  
Target
Name:
Histamine H3 receptor
Synonyms:
HISTAMINE H3 HRH3_CAVPO | Histamine H3 receptor
Type:
Enzyme Catalytic Domain
Mol. Mass.:
48753.61
Organism:
GUINEA PIG
Description:
HISTAMINE H3 HRH3 GUINEA PIG::Q9JI35
Residue:
445
  
Inhibitor
Name:
BDBM50441652
Synonyms:
CHEMBL2437433
Type:
Small organic molecule
Emp. Form.:
C28H31FN8O2
Mol. Mass.:
530.5965
SMILES:
Nc1cc(CN2CCC(CC2)C(=O)N2CCC(CC2)n2c3ccc(F)cc3n(-c3cnccn3)c2=O)ccn1
: