Target
Aromatase
Ligand
BDBM50442761
Substrate
Meas. Tech.
ChEMBL_989965 (CHEMBL2447322)
Ki
647±n/a nM
Citation
 McNulty, JNielsen, AJBrown, CEDiFrancesco, BRVurgun, NNair, JJCrankshaw, DJHolloway, AC Investigation of aryl halides as ketone bioisosteres: refinement of potent and selective inhibitors of human cytochrome P450 19A1 (aromatase). Bioorg Med Chem Lett 23:6060-3 (2013)  
Target
Name:
Aromatase
Synonyms:
ARO1 CP19A_HUMAN CYP19 CYPXIX Cytochrome P450 19A1 Cytochrome P450-C19 (CYP19) FL cytokine receptor precursor | P-450AROM
Type:
Enzyme
Mol. Mass.:
57888.92
Organism:
Homo sapiens (Human)
Description:
P11511
Residue:
503
  
Inhibitor
Name:
BDBM50442761
Synonyms:
CHEMBL2443364
Type:
Small organic molecule
Emp. Form.:
C19H18BrN3O2
Mol. Mass.:
400.269
SMILES:
CC(=O)O[C@H]([C@H](Cn1ccnn1)c1ccc(Br)cc1)c1ccccc1
: