Target
Solute carrier organic anion transporter family member 1B3
Ligand
BDBM50442880
Substrate
Meas. Tech.
ChEMBL_1265867 (CHEMBL3039493)
Ki
680±n/a nM
Citation
 De Bruyn, Tvan Westen, GJIjzerman, APStieger, Bde Witte, PAugustijns, PFAnnaert, PP Structure-based identification of OATP1B1/3 inhibitors. Mol Pharmacol 83:1257-67 (2013)  
Target
Name:
Solute carrier organic anion transporter family member 1B3
Synonyms:
LST2 OATP8 SLC21A8 SO1B3_HUMAN Solute carrier organic anion transporter family member 1B3 (OATP1B3)
Type:
Protein
Mol. Mass.:
77425.75
Organism:
Homo sapiens (Human)
Description:
Q9NPD5
Residue:
702
  
Inhibitor
Name:
BDBM50442880
Synonyms:
4-Epi-Hederagenin US11660306, Example Hederagenin
Type:
Small organic molecule
Emp. Form.:
C30H48O4
Mol. Mass.:
472.6997
SMILES:
[H][C@@]12CC(C)(C)CC[C@@]1(CC[C@]1(C)C2=CC[C@]2([H])[C@@]3(C)CC[C@H](O)[C@@](C)(CO)[C@]3([H])CC[C@@]12C)C(O)=O
: