Target
Solute carrier organic anion transporter family member 1B3
Ligand
BDBM50442885
Substrate
Meas. Tech.
ChEMBL_1265867 (CHEMBL3039493)
Ki
1490±n/a nM
Citation
 De Bruyn, Tvan Westen, GJIjzerman, APStieger, Bde Witte, PAugustijns, PFAnnaert, PP Structure-based identification of OATP1B1/3 inhibitors. Mol Pharmacol 83:1257-67 (2013)  
Target
Name:
Solute carrier organic anion transporter family member 1B3
Synonyms:
LST2 OATP8 SLC21A8 SO1B3_HUMAN Solute carrier organic anion transporter family member 1B3 (OATP1B3)
Type:
Protein
Mol. Mass.:
77425.75
Organism:
Homo sapiens (Human)
Description:
Q9NPD5
Residue:
702
  
Inhibitor
Name:
BDBM50442885
Synonyms:
CHEMBL3138693
Type:
Small organic molecule
Emp. Form.:
C28H38O6
Mol. Mass.:
470.5977
SMILES:
[H][C@]12CC[C@@]3(C)[C@@H](OC(=O)C=C3[C@]1(C)[C@@H](C[C@@]1([H])C(C)(C)[C@@H](O)CC[C@]21C)OC(C)=O)c1ccoc1
: