Target
Tyrosine-protein kinase Mer
Ligand
BDBM50444066
Substrate
Meas. Tech.
ChEMBL_1279519 (CHEMBL3097238)
IC50
1.8±n/a nM
Citation
 Zhang, WZhang, DStashko, MADeRyckere, DHunter, DKireev, DMiley, MJCummings, CLee, MNorris-Drouin, JStewart, WMSather, SZhou, YKirkpatrick, GMachius, MJanzen, WPEarp, HSGraham, DKFrye, SVWang, X Pseudo-cyclization through intramolecular hydrogen bond enables discovery of pyridine substituted pyrimidines as new Mer kinase inhibitors. J Med Chem 56:9683-92 (2014)  
Target
Name:
Tyrosine-protein kinase Mer
Synonyms:
MER MERTK Proto-oncogene c-Mer Receptor tyrosine kinase MerTK | Tyrosine-protein kinase Mer
Type:
PROTEIN
Mol. Mass.:
110234.77
Organism:
Homo sapiens (Human)
Description:
ChEMBL_1498723
Residue:
999
  
Inhibitor
Name:
BDBM50444066
Synonyms:
CHEMBL3092799
Type:
Small organic molecule
Emp. Form.:
C19H28N6
Mol. Mass.:
340.4658
SMILES:
CCCCNc1ncc(c(N[C@H]2CC[C@H](N)CC2)n1)-c1ccccn1
: