Target
Nicotinamide phosphoribosyltransferase
Ligand
BDBM50444651
Substrate
Meas. Tech.
ChEMBL_1281258 (CHEMBL3100993)
IC50
2.2±n/a nM
Citation
 Zheng, XBaumeister, TBuckmelter, AJCaligiuri, MClodfelter, KHHan, BHo, YCKley, NLin, JReynolds, DJSharma, GSmith, CCWang, ZDragovich, PSOh, AWang, WZak, MWang, YYuen, PWBair, KW Discovery of potent and efficacious cyanoguanidine-containing nicotinamide phosphoribosyltransferase (Nampt) inhibitors. Bioorg Med Chem Lett 24:337-43 (2013)  
Target
Name:
Nicotinamide phosphoribosyltransferase
Synonyms:
NAMPT NAmPRTase Nicotinamide phosphoribosyltransferase (NAMPT) PBEF1 | Pre-B-cell colony-enhancing factor 1
Type:
Enzyme
Mol. Mass.:
55524.98
Organism:
Homo sapiens (Human)
Description:
P43490
Residue:
491
  
Inhibitor
Name:
BDBM50444651
Synonyms:
CHEMBL3098512
Type:
Small organic molecule
Emp. Form.:
C20H17N5O2S
Mol. Mass.:
391.446
SMILES:
O=S(=O)(c1ccccc1)c1ccc(CNC(NC#N)=Nc2cccnc2)cc1
: