Target
Acetyl-CoA carboxylase 1
Ligand
BDBM50446513
Substrate
Meas. Tech.
ChEMBL_1286313 (CHEMBL3111440)
IC50
4280±n/a nM
Citation
 Bourbeau, MPSiegmund, AAllen, JGShu, HFotsch, CBartberger, MDKim, KWKomorowski, RGraham, MBusby, JWang, MMeyer, JXu, YSalyers, KFielden, MVéniant, MMGu, W Piperazine oxadiazole inhibitors of acetyl-CoA carboxylase. J Med Chem 56:10132-41 (2013)  
Target
Name:
Acetyl-CoA carboxylase 1
Synonyms:
ACAC ACACA_HUMAN ACC1 Acetyl-CoA carboxylase 1 | Acetyl-CoA carboxylase 1 (ACC1)
Type:
Protein
Mol. Mass.:
265543.22
Organism:
Homo sapiens (Human)
Description:
Q13085
Residue:
2346
  
Inhibitor
Name:
BDBM50446513
Synonyms:
CHEMBL3110094
Type:
Small organic molecule
Emp. Form.:
C19H20N2O2
Mol. Mass.:
308.3743
SMILES:
CCCOc1ccc(cc1)-c1ccc(cc1)-c1noc(CC)n1
: