Target
Serine/threonine-protein kinase PAK 4
Ligand
BDBM101536
Substrate
Meas. Tech.
ChEMBL_1294410 (CHEMBL3129195)
Ki
15±n/a nM
Citation
 Staben, STFeng, JALyle, KBelvin, MBoggs, JBurch, JDChua, CCCui, HDiPasquale, AGFriedman, LSHeise, CKoeppen, HKotey, AMintzer, ROh, ARoberts, DARouge, LRudolph, JTam, CWang, WXiao, YYoung, AZhang, YHoeflich, KP Back pocket flexibility provides group II p21-activated kinase (PAK) selectivity for type I 1/2 kinase inhibitors. J Med Chem 57:1033-45 (2014)  
Target
Name:
Serine/threonine-protein kinase PAK 4
Synonyms:
KIAA1142 PAK4_HUMAN | p21-Activated kinase 4 (PAK4)
Type:
Protein
Mol. Mass.:
64098.01
Organism:
Homo sapiens (Human)
Description:
O96013
Residue:
591
  
Inhibitor
Name:
BDBM101536
Synonyms:
CHEMBL3128043 US8530652, 114 | US8530652, 63
Type:
Small organic molecule
Emp. Form.:
C25H30N8OS
Mol. Mass.:
490.624
SMILES:
CN(C)C[C@@H](NC(=O)N1Cc2c(Nc3nc(C)nc4ccsc34)[nH]nc2C1(C)C)c1ccccc1
: