Target
Broad substrate specificity ATP-binding cassette transporter ABCG2
Ligand
BDBM50009160
Substrate
Meas. Tech.
ChEMBL_1338470 (CHEMBL3240932)
EC50
126±n/a nM
Citation
 Winter, EDevantier Neuenfeldt, PChiaradia-Delatorre, LDGauthier, CYunes, RANunes, RJCreczynski-Pasa, TBDi Pietro, A Symmetric bis-chalcones as a new type of breast cancer resistance protein inhibitors with a mechanism different from that of chromones. J Med Chem 57:2930-41 (2014)  
Target
Name:
Broad substrate specificity ATP-binding cassette transporter ABCG2
Synonyms:
ABCG2 ABCP ATP-binding cassette sub-family G member 2 ATP-binding cassette, sub-family G, member 2 BCRP1 CDw338 Mitoxantrone resistance-associated protein Urate exporter
Type:
Multi-pass membrane protein; monomer or homodimer; disulfide-linked
Mol. Mass.:
72329.48
Organism:
Homo sapiens (Human)
Description:
Q9UNQ0
Residue:
655
  
Inhibitor
Name:
BDBM50009160
Synonyms:
CHEMBL3238330
Type:
Small organic molecule
Emp. Form.:
C28H26O6
Mol. Mass.:
458.5024
SMILES:
COc1cccc(OC)c1\C=C\C(=O)c1ccc(cc1)C(=O)\C=C\c1c(OC)cccc1OC
: