Target
Polyunsaturated fatty acid 5-lipoxygenase
Ligand
BDBM50012188
Substrate
Meas. Tech.
ChEMBL_1353587 (CHEMBL3270668)
IC50
1500±n/a nM
Citation
 Pergola, CGaboriaud-Kolar, NJestädt, NKönig, SKritsanida, MSchaible, AMLi, HGarscha, UWeinigel, CBarz, DAlbring, KFHuber, OSkaltsounis, ALWerz, O Indirubin core structure of glycogen synthase kinase-3 inhibitors as novel chemotype for intervention with 5-lipoxygenase. J Med Chem 57:3715-23 (2014)  
Target
Name:
Polyunsaturated fatty acid 5-lipoxygenase
Synonyms:
5-LO 5-Lipoxygenase (5-LO) 5-Lipoygenase ALOX5 LOG5 | LOX5_HUMAN
Type:
Enzyme
Mol. Mass.:
77972.74
Organism:
Homo sapiens (Human)
Description:
Recombinant protein was purified from E. coli lysate. After ammonium sulfate precipitation and subsequent steps, the supernatant (S100) was used for 5-LO activity assay.
Residue:
674
  
Inhibitor
Name:
BDBM50012188
Synonyms:
6BIO
Type:
Small organic molecule
Emp. Form.:
C16H10BrN3O2
Mol. Mass.:
356.174
SMILES:
O\N=C1\C(\Nc2ccccc\12)=C1\C(=O)Nc2cc(Br)ccc12
: