Target
TGF-beta receptor type-1
Ligand
BDBM50252542
Substrate
Meas. Tech.
ChEMBL_1351655 (CHEMBL3269342)
IC50
480±n/a nM
Citation
 Jin, CHKrishnaiah, MSreenu, DSubrahmanyam, VBPark, HJPark, SJSheen, YYKim, DK 4-([1,2,4]Triazolo[1,5-a]pyridin-6-yl)-5(3)-(6-methylpyridin-2-yl)imidazole and -pyrazole derivatives as potent and selective inhibitors of transforming growth factor-ß type I receptor kinase. Bioorg Med Chem 22:2724-32 (2014)  
Target
Name:
TGF-beta receptor type-1
Synonyms:
ALK-5 Activin A receptor type II-like protein kinase of 53kD SKR4 TGF-beta receptor type I TGFBR1 TGFR1_HUMAN Transforming growth factor-beta receptor type I
Type:
enzyme
Mol. Mass.:
55968.24
Organism:
Homo sapiens (Human)
Description:
P36897
Residue:
503
  
Inhibitor
Name:
BDBM50252542
Synonyms:
3-((5-(6-methylpyridin-2-yl)-4-(quinoxalin-6-yl)-1H-imidazol-2-yl)methyl)benzamide IN-1130
Type:
Small organic molecule
Emp. Form.:
C25H20N6O
Mol. Mass.:
420.4659
SMILES:
Cc1cccc(n1)-c1nc(Cc2cccc(c2)C(N)=O)[nH]c1-c1ccc2nccnc2c1
: