Target
TGF-beta receptor type-1
Ligand
BDBM50015700
Substrate
Meas. Tech.
ChEMBL_1349289 (CHEMBL3268789)
IC50
>10000±n/a nM
Citation
 Jin, CHKrishnaiah, MSreenu, DSubrahmanyam, VBRao, KSLee, HJPark, SJPark, HJLee, KSheen, YYKim, DK Discovery of N-((4-([1,2,4]triazolo[1,5-a]pyridin-6-yl)-5-(6-methylpyridin-2-yl)-1H-imidazol-2-yl)methyl)-2-fluoroaniline (EW-7197): a highly potent, selective, and orally bioavailable inhibitor of TGF-ß type I receptor kinase as cancer immunotherapeutic/antifibrotic agent. J Med Chem 57:4213-38 (2014)  
Target
Name:
TGF-beta receptor type-1
Synonyms:
ALK-5 Activin A receptor type II-like protein kinase of 53kD SKR4 TGF-beta receptor type I TGFBR1 TGFR1_HUMAN Transforming growth factor-beta receptor type I
Type:
enzyme
Mol. Mass.:
55968.24
Organism:
Homo sapiens (Human)
Description:
P36897
Residue:
503
  
Inhibitor
Name:
BDBM50015700
Synonyms:
CHEMBL3260604 | USRE47141, Example 53
Type:
Small organic molecule
Emp. Form.:
C23H18F3N7O
Mol. Mass.:
465.4305
SMILES:
Cc1cccc(n1)-c1[nH]c(CNc2ccc(OC(F)(F)F)cc2)nc1-c1ccc2ncnn2c1
: