Target
Lactase/phlorizin hydrolase
Ligand
BDBM50028250
Substrate
Meas. Tech.
ChEMBL_1435478 (CHEMBL3384693)
IC50
25000±n/a nM
Citation
 Ghisaidoobe, ATvan den Berg, RJButt, SSStrijland, ADonker-Koopman, WEScheij, Svan den Nieuwendijk, AMKoomen, GJvan Loevezijn, ALeemhuis, MWennekes, Tvan der Stelt, Mvan der Marel, GAvan Boeckel, CAAerts, JMOverkleeft, HS Identification and development of biphenyl substituted iminosugars as improved dual glucosylceramide synthase/neutral glucosylceramidase inhibitors. J Med Chem 57:9096-104 (2014)  
Target
Name:
Lactase/phlorizin hydrolase
Synonyms:
LCT LPH_HUMAN | Lactase-phlorizin hydrolase
Type:
PROTEIN
Mol. Mass.:
218576.40
Organism:
Homo sapiens (Human)
Description:
ChEMBL_1435478
Residue:
1927
  
Inhibitor
Name:
BDBM50028250
Synonyms:
CHEMBL3354630
Type:
Small organic molecule
Emp. Form.:
C24H33NO5
Mol. Mass.:
415.5225
SMILES:
OC[C@H]1[C@@H](O)[C@H](O)[C@@H](O)CN1CCCCCOCc1ccccc1-c1ccccc1
: