Target
Glutamate receptor 2
Ligand
BDBM50032248
Substrate
Meas. Tech.
ChEMBL_1438652 (CHEMBL3387343)
Kd
9800±n/a nM
Citation
 Francotte, PNørholm, ABDeva, TOlsen, LFrydenvang, KGoffin, EFraikin, Pde Tullio, PChallal, SThomas, JYIop, FLouis, CBotez-Pop, ILestage, PDanober, LKastrup, JSPirotte, B Positive allosteric modulators of 2-amino-3-(3-hydroxy-5-methylisoxazol-4-yl)propionic acid receptors belonging to 4-cyclopropyl-3,4-dihydro-2h-1,2,4-pyridothiadiazine dioxides and diversely chloro-substituted 4-cyclopropyl-3,4-dihydro-2H-1,2,4-benzothiadiazine 1,1-dioxides. J Med Chem 57:9539-53 (2014)  
Target
Name:
Glutamate receptor 2
Synonyms:
AMPA-selective glutamate receptor 2 GRIA2 GluR-2 GluR-K2 Glutamate receptor 2 Glutamate receptor AMPA 2/3 Glutamate receptor ionotropic, AMPA 2
Type:
Enzyme Catalytic Domain
Mol. Mass.:
98825.96
Organism:
Homo sapiens (Human)
Description:
Glutamate AMPA 2 GRIA2 HUMAN::P42262
Residue:
883
  
Inhibitor
Name:
BDBM50032248
Synonyms:
CHEMBL103741
Type:
Small organic molecule
Emp. Form.:
C8H11N3O2S
Mol. Mass.:
213.257
SMILES:
CCN1CNS(=O)(=O)c2ncccc12
: