Target
Free fatty acid receptor 2
Ligand
BDBM50032277
Substrate
Meas. Tech.
ChEMBL_1440135 (CHEMBL3382548)
IC50
227±n/a nM
Citation
 Pizzonero, MDupont, SBabel, MBeaumont, SBienvenu, NBlanqué, RCherel, LChristophe, TCrescenzi, BDe Lemos, EDelerive, PDeprez, PDe Vos, SDjata, FFletcher, SKopiejewski, SL'Ebraly, CLefrançois, JMLavazais, SManioc, MNelles, LOste, LPolancec, DQuénéhen, VSoulas, FTriballeau, Nvan der Aar, EMVandeghinste, NWakselman, EBrys, RSaniere, L Discovery and optimization of an azetidine chemical series as a free fatty acid receptor 2 (FFA2) antagonist: from hit to clinic. J Med Chem 57:10044-57 (2014)  
Target
Name:
Free fatty acid receptor 2
Synonyms:
FFA2 FFAR2_HUMAN GPCR43 | GPR43
Type:
PROTEIN
Mol. Mass.:
37156.44
Organism:
Homo sapiens (Human)
Description:
ChEMBL_1508993
Residue:
330
  
Inhibitor
Name:
BDBM50032277
Synonyms:
CHEMBL3353504
Type:
Small organic molecule
Emp. Form.:
C24H25ClN2O5
Mol. Mass.:
456.919
SMILES:
CC1(CCN1C(=O)CC1=COC2C=CC=CC12)C(=O)N(CC(O)=O)Cc1ccc(Cl)cc1
: