Target
Cytochrome P450 1A2
Ligand
BDBM50041983
Substrate
Meas. Tech.
ChEMBL_1443697 (CHEMBL3380170)
IC50
>50000±n/a nM
Citation
 Buzard, DJLopez, LMoody, JKawasaki, ASchrader, TOKasem, MJohnson, BZhu, XThoresen, LKim, SHGharbaoui, TSengupta, DCalvano, LKrishnan, AGao, YSemple, GEdwards, JBarden, JMorgan, MUsmani, KChen, CSadeque, AChen, WChristopher, RJThatte, JFu, LSolomon, MWhelan, KAl-Shamma, HGatlin, JGaidarov, IAnthony, TLe, MUnett, DJStirn, SBlackburn, ABehan, DPJones, RM (7-Benzyloxy-2,3-dihydro-1H-pyrrolo[1,2-a]indol-1-yl)acetic Acids as S1P1 Functional Antagonists. ACS Med Chem Lett 5:1334-9 (2014)  
Target
Name:
Cytochrome P450 1A2
Synonyms:
CP1A2_HUMAN CYPIA2 Cytochrome P(3)450 Cytochrome P450 1A2 (CYP1A2) Cytochrome P450-P3
Type:
Enzyme
Mol. Mass.:
58423.38
Organism:
Homo sapiens (Human)
Description:
P05177
Residue:
516
  
Inhibitor
Name:
BDBM50041983
Synonyms:
CHEMBL3359523
Type:
Small organic molecule
Emp. Form.:
C24H23ClF3NO4
Mol. Mass.:
481.892
SMILES:
CC(C)Oc1ccc(COc2ccc3n4CC[C@H](CC(O)=O)c4c(Cl)c3c2)cc1C(F)(F)F
: