Target
Serine/threonine-protein kinase/endoribonuclease IRE1
Ligand
BDBM50043710
Substrate
Meas. Tech.
ChEMBL_1445183 (CHEMBL3375435)
IC50
14±n/a nM
Citation
 Harrington, PEBiswas, KMalwitz, DTasker, ASMohr, CAndrews, KLDellamaggiore, KKendall, RBeckmann, HJaeckel, PMaterna-Reichelt, SAllen, JRLipford, JR Unfolded Protein Response in Cancer: IRE1a Inhibition by Selective Kinase Ligands Does Not Impair Tumor Cell Viability. ACS Med Chem Lett 6:68-72 (2015)  
Target
Name:
Serine/threonine-protein kinase/endoribonuclease IRE1
Synonyms:
ERN1 Endoplasmic reticulum-to-nucleus signaling 1 IRE1 Inositol requiring enzyme 1 (IRE-1alpha) Inositol-requiring protein 1 Ire1-alpha Serine/threonine-protein kinase/endoribonuclease IRE1 hIRE1p
Type:
Enzyme
Mol. Mass.:
109731.20
Organism:
Homo sapiens (Human)
Description:
O75460
Residue:
977
  
Inhibitor
Name:
BDBM50043710
Synonyms:
CHEMBL3356007
Type:
Small organic molecule
Emp. Form.:
C32H31ClN6O3S
Mol. Mass.:
615.145
SMILES:
Cc1cc(NS(=O)(=O)c2ccccc2Cl)c2ccccc2c1Oc1ncccc1-c1ccnc(N[C@H]2CC[C@H](N)CC2)n1
: